Target
Platelet-activating factor acetylhydrolase
Ligand
BDBM50085644
Substrate
Meas. Tech.
ChEBML_156217
IC50
12600±n/a nM
Citation
 Boyd, HFFlynn, STHickey, DMIfe, RJJones, MLeach, CAMacphee, CHMilliner, KJRawlings, DASlingsby, BPSmith, SAStansfield, IGTew, DGTheobald, CJ 2-(Alkylthio)pyrimidin-4-ones as novel, reversible inhibitors of lipoprotein-associated phospholipase A2. Bioorg Med Chem Lett 10:395-8 (2000)  
Target
Name:
Platelet-activating factor acetylhydrolase
Synonyms:
1-alkyl-2-acetylglycerophosphocholine esterase LDL-PLA(2) PAF 2-acylhydrolase PAFAH PLA2G7 | Platelet-activating factor acetylhydrolase
Type:
PROTEIN
Mol. Mass.:
50084.41
Organism:
Homo sapiens (Human)
Description:
ChEMBL_156212
Residue:
441
  
Inhibitor
Name:
BDBM50085644
Synonyms:
2-[7-(4-Chloro-benzenesulfonyl)-heptylsulfanyl]-5-pyridin-3-ylmethyl-1H-pyrimidin-4-one | CHEMBL128939
Type:
Small organic molecule
Emp. Form.:
C23H26ClN3O3S2
Mol. Mass.:
492.054
SMILES:
Clc1ccc(cc1)S(=O)(=O)CCCCCCCSc1ncc(Cc2cccnc2)c(=O)[nH]1
: