Target
Gonadotropin-releasing hormone receptor
Ligand
BDBM50085718
Substrate
Meas. Tech.
ChEMBL_71750 (CHEMBL680272)
Ki
0.2±n/a nM
Citation
 Rivier, JEStruthers, RSPorter, JLahrichi, SLJiang, GCervini, LAIbea, MKirby, DAKoerber, SCRivier, CL Design of potent dicyclic (4-10/5-8) gonadotropin releasing hormone (GnRH) antagonists. J Med Chem 43:784-96 (2000)  
Target
Name:
Gonadotropin-releasing hormone receptor
Synonyms:
GNRHR_RAT GnRH-R | Gnrhr
Type:
PROTEIN
Mol. Mass.:
37767.60
Organism:
Rattus norvegicus
Description:
ChEMBL_1335047
Residue:
327
  
Inhibitor
Name:
BDBM50085718
Synonyms:
CHEMBL410820 | DiCyclo (4-10/5,5'-8) [Ac-D Nal, D Cpa, D Pal, Asp, Glu(Phe), D Cit, Leu, Dbu, Pro, Dpr]GnRH
Type:
Small organic molecule
Emp. Form.:
C65H88ClN17O15
Mol. Mass.:
1382.952
SMILES:
CC[C@H](NC(C)=O)C(=O)N[C@@H](Cc1ccc(Cl)cc1)C(=O)N[C@@H](Cc1cccnc1)C(=O)N[C@H]1CC(=O)NCC(NC(=O)[C@@H]2CCCN2C(=O)C2CCNC(=O)[C@@H](Cc3ccccc3)NC(=O)CC[C@H](NC1=O)C(=O)N[C@@H](CCCNC(N)=O)C(=O)N[C@H](CC(C)C)C(=O)N2)C(N)=O
: