Target
Gonadotropin-releasing hormone receptor
Ligand
BDBM50085814
Substrate
Meas. Tech.
ChEMBL_71869 (CHEMBL877834)
Ki
0.14±n/a nM
Citation
 Koerber, SCRizo, JStruthers, RSRivier, JE Consensus bioactive conformation of cyclic GnRH antagonists defined by NMR and molecular modeling. J Med Chem 43:819-28 (2000)  
Target
Name:
Gonadotropin-releasing hormone receptor
Synonyms:
GNRHR GRHR GnRH-R Gonadotropin-releasing hormone receptor | Gonadotropin-releasing hormone receptor (GnRH)
Type:
Enzyme
Mol. Mass.:
37749.45
Organism:
Homo sapiens (Human)
Description:
P30968
Residue:
328
  
Inhibitor
Name:
BDBM50085814
Synonyms:
CHEMBL405548 | dicyclo(4-10/5,5-8)[Ac-D2Nal-DCpa-DPal-Asp-Glu(Gly)-DArg-Leu-Dbu-Pro-Dpr-NH2]
Type:
Small organic molecule
Emp. Form.:
C67H87ClN18O14
Mol. Mass.:
1403.973
SMILES:
CC(C)C[C@@H]1NC(=O)[C@@H](CCCNC(N)=N)NC(=O)[C@@H]2CCC(=O)NCC(=O)NCC[C@@H](NC1=O)C(=O)N1CCC[C@H]1C(=O)N[C@@H](CNC(=O)C[C@H](NC(=O)[C@@H](Cc1cccnc1)NC(=O)[C@@H](Cc1ccc(Cl)cc1)NC(=O)[C@@H](Cc1ccc3ccccc3c1)NC(C)=O)C(=O)N2)C(N)=O
: