Target
Epidermal growth factor receptor
Ligand
BDBM50530623
Substrate
Meas. Tech.
ChEMBL_1913526 (CHEMBL4416109)
IC50
0.043000±n/a nM
Citation
 Lin, SYChang Hsu, YPeng, YHKe, YYLin, WHSun, HYShiao, HYKuo, FMChen, PYLien, TWChen, CHChu, CYWang, SYYeh, KCChen, CPHsu, TAWu, SYYeh, TKChen, CTHsieh, HP Discovery of a Furanopyrimidine-Based Epidermal Growth Factor Receptor Inhibitor (DBPR112) as a Clinical Candidate for the Treatment of Non-Small Cell Lung Cancer. J Med Chem 62:10108-10123 (2019)  
Target
Name:
Epidermal growth factor receptor
Synonyms:
EGF Receptor Substrate EGFR_HUMAN ERBB1 Epidermal Growth Factor Receptor erbB-1 Epidermal growth factor receptor (EGFR) HER1 Proto-oncogene c-ErbB-1 Tyrosine-Protein Kinase ErbB-1
Type:
Receptor Kinase Domain
Mol. Mass.:
134279.59
Organism:
Homo sapiens (Human)
Description:
P00533
Residue:
1210
  
Inhibitor
Name:
BDBM50530623
Synonyms:
CHEMBL4521381
Type:
Small organic molecule
Emp. Form.:
C32H31N5O3
Mol. Mass.:
533.6202
SMILES:
CN(C)C\C=C\C(=O)Nc1cccc(c1)-c1c(oc2ncnc(N[C@H](CO)c3ccccc3)c12)-c1ccccc1
: