Target
Cytochrome P450 1A2
Ligand
BDBM50086062
Substrate
Meas. Tech.
ChEMBL_51356 (CHEMBL666157)
IC50
7000±n/a nM
Citation
 Bromidge, SMDabbs, SDavies, DTDavies, SDuckworth, DMForbes, ITGaster, LMHam, PJones, GEKing, FDMulholland, KRSaunders, DVWyman, PABlaney, FEClarke, SEBlackburn, TPHolland, VKennett, GALightowler, SMiddlemiss, DNTrail, BRiley, GJWood, MD Biarylcarbamoylindolines are novel and selective 5-HT(2C) receptor inverse agonists: identification of 5-methyl-1-[[2-[(2-methyl-3-pyridyl)oxy]- 5-pyridyl]carbamoyl]-6-trifluoromethylindoline (SB-243213) as a potential antidepressant/anxiolytic agent. J Med Chem 43:1123-34 (2000)  
Target
Name:
Cytochrome P450 1A2
Synonyms:
CP1A2_HUMAN CYPIA2 Cytochrome P(3)450 Cytochrome P450 1A2 (CYP1A2) Cytochrome P450-P3
Type:
Enzyme
Mol. Mass.:
58423.38
Organism:
Homo sapiens (Human)
Description:
P05177
Residue:
516
  
Inhibitor
Name:
BDBM50086062
Synonyms:
5-Methoxy-6-trifluoromethyl-2,3-dihydro-indole-1-carboxylic acid (3-bromo-5-pyridin-3-yl-phenyl)-amide TCMDC-139024
Type:
Small organic molecule
Emp. Form.:
C22H17BrF3N3O2
Mol. Mass.:
492.288
SMILES:
COc1cc2CCN(C(=O)Nc3cc(Br)cc(c3)-c3cccnc3)c2cc1C(F)(F)F
: