Target
Cytochrome P450 1A2
Ligand
BDBM85097
Substrate
Meas. Tech.
ChEMBL_51355 (CHEMBL666156)
IC50
>100000±n/a nM
Citation
 Bromidge, SMDabbs, SDavies, DTDavies, SDuckworth, DMForbes, ITGaster, LMHam, PJones, GEKing, FDMulholland, KRSaunders, DVWyman, PABlaney, FEClarke, SEBlackburn, TPHolland, VKennett, GALightowler, SMiddlemiss, DNTrail, BRiley, GJWood, MD Biarylcarbamoylindolines are novel and selective 5-HT(2C) receptor inverse agonists: identification of 5-methyl-1-[[2-[(2-methyl-3-pyridyl)oxy]- 5-pyridyl]carbamoyl]-6-trifluoromethylindoline (SB-243213) as a potential antidepressant/anxiolytic agent. J Med Chem 43:1123-34 (2000)  
Target
Name:
Cytochrome P450 1A2
Synonyms:
CP1A2_HUMAN CYPIA2 Cytochrome P(3)450 Cytochrome P450 1A2 (CYP1A2) Cytochrome P450-P3
Type:
Enzyme
Mol. Mass.:
58423.38
Organism:
Homo sapiens (Human)
Description:
P05177
Residue:
516
  
Inhibitor
Name:
BDBM85097
Synonyms:
CAS_181632-25-7 SB 242084
Type:
Small organic molecule
Emp. Form.:
C21H19ClN4O2
Mol. Mass.:
394.854
SMILES:
Cc1cc2CCN(C(=O)Nc3ccc(Oc4cccnc4C)nc3)c2cc1Cl
: