Target
5-hydroxytryptamine receptor 1B
Ligand
BDBM50086106
Substrate
Meas. Tech.
ChEMBL_1774 (CHEMBL616558)
IC50
133±n/a nM
Citation
 Matzen, Lvan Amsterdam, CRautenberg, WGreiner, HEHarting, JSeyfried, CABöttcher, H 5-HT reuptake inhibitors with 5-HT(1B/1D) antagonistic activity: a new approach toward efficient antidepressants. J Med Chem 43:1149-57 (2000)  
Target
Name:
5-hydroxytryptamine receptor 1B
Synonyms:
5-HT-1B 5-hydroxytryptamine receptor 1B (5HT1B) 5ht1b Serotonin 1 (5-HT1) receptor Serotonin receptor 1B
Type:
Protein
Mol. Mass.:
43173.33
Organism:
Rattus norvegicus (Rat)
Description:
P28564
Residue:
386
  
Inhibitor
Name:
BDBM50086106
Synonyms:
1-[3-(2-Dimethylamino-ethoxy)-4-methoxy-phenyl]-3-{2-[4-(6-fluoro-1H-indol-3-yl)-piperidin-1-yl]-ethyl}-urea | CHEMBL279320
Type:
Small organic molecule
Emp. Form.:
C27H36FN5O3
Mol. Mass.:
497.6048
SMILES:
COc1ccc(NC(=O)NCCN2CCC(CC2)c2c[nH]c3cc(F)ccc23)cc1OCCN(C)C
: