Target
5-hydroxytryptamine receptor 1A
Ligand
BDBM50086097
Substrate
Meas. Tech.
ChEMBL_843 (CHEMBL615406)
IC50
27±n/a nM
Citation
 Matzen, Lvan Amsterdam, CRautenberg, WGreiner, HEHarting, JSeyfried, CABöttcher, H 5-HT reuptake inhibitors with 5-HT(1B/1D) antagonistic activity: a new approach toward efficient antidepressants. J Med Chem 43:1149-57 (2000)  
Target
Name:
5-hydroxytryptamine receptor 1A
Synonyms:
5-HT-1A 5-HT1A 5-hydroxytryptamine receptor 1A (5HT1A) 5ht1a Htr1a Serotonin 1a (5-HT1a) receptor/Adrenergic receptor alpha-1 | Serotonin receptor 1A
Type:
G Protein-Coupled Receptor (GPCR)
Mol. Mass.:
46445.29
Organism:
Rattus norvegicus (rat)
Description:
Binding assays were performed using rat hippocampal membranes.
Residue:
422
  
Inhibitor
Name:
BDBM50086097
Synonyms:
1-[2-(5-Fluoro-1H-indol-3-yl)-ethyl]-3-[4-methoxy-3-(4-methyl-piperazin-1-yl)-phenyl]-urea | CHEMBL16035
Type:
Small organic molecule
Emp. Form.:
C23H28FN5O2
Mol. Mass.:
425.4991
SMILES:
COc1ccc(NC(=O)NCCc2c[nH]c3ccc(F)cc23)cc1N1CCN(C)CC1
: