Target
Glutamate receptor ionotropic, NMDA 2B
Ligand
BDBM50086381
Substrate
Meas. Tech.
ChEBML_143319
IC50
1000±n/a nM
Citation
 Gregory, TFWright, JLWise, LDMeltzer, LTSerpa, KAKonkoy, CSWhittemore, ERWoodward, RM Parallel synthesis of a series of subtype-selective NMDA receptor antagonists. Bioorg Med Chem Lett 10:527-9 (2000)  
Target
Name:
Glutamate receptor ionotropic, NMDA 2B
Synonyms:
GRIN2B Glutamate [NMDA] receptor subunit epsilon 2 N-methyl D-aspartate receptor subtype 2B NMDAR2B NR3 | hNR3
Type:
PROTEIN
Mol. Mass.:
166375.46
Organism:
Homo sapiens (Human)
Description:
ChEMBL_1438829
Residue:
1484
  
Inhibitor
Name:
BDBM50086381
Synonyms:
4-Benzyl-1-[3-(5-methyl-2H-[1,2,4]triazol-3-ylsulfanyl)-propyl]-piperidine | CHEMBL358601
Type:
Small organic molecule
Emp. Form.:
C18H26N4S
Mol. Mass.:
330.491
SMILES:
Cc1nnc(SCCCN2CCC(Cc3ccccc3)CC2)[nH]1
: