Target
DNA topoisomerase 1
Ligand
BDBM50086571
Substrate
Meas. Tech.
ChEBML_208412
EC50
17±n/a nM
Citation
 Ohkubo, MNishimura, TKawamoto, HNakano, MHonma, TYoshinari, TArakawa, HSuda, HMorishima, HNishimura, S Synthesis and biological activities of NB-506 analogues modified at the glucose group. Bioorg Med Chem Lett 10:419-22 (2000)  
Target
Name:
DNA topoisomerase 1
Synonyms:
DNA topoisomerase I TOP1 | TOP1_HUMAN
Type:
Enzyme
Mol. Mass.:
90771.02
Organism:
Homo sapiens (Human)
Description:
P11387
Residue:
765
  
Inhibitor
Name:
BDBM50086571
Synonyms:
CHEMBL135491 | NB-506 Analogue
Type:
Small organic molecule
Emp. Form.:
C28H26N4O10
Mol. Mass.:
578.5268
SMILES:
OCC(CO)NN1C(=O)c2c(C1=O)c1c3ccc(O)cc3n([C@@H]3O[C@H](CO)[C@H](O)[C@H]3O)c1c1[nH]c3cc(O)ccc3c21
: