Target
Integrin alpha-IIb/beta-3
Ligand
BDBM50055896
Substrate
Meas. Tech.
ChEMBL_220133 (CHEMBL841416)
IC50
4±n/a nM
Citation
 Sielecki, TMWityak, JLiu, JMousa, SAThoolen, MWexler, RROlson, RE Ring constrained analogues of beta-alanine-containing GPIIb/IIIa receptor antagonists. Bioorg Med Chem Lett 10:449-52 (2000)  
Target
Name:
Integrin alpha-IIb/beta-3
Synonyms:
Glycoprotein IIb/IIIa
Type:
Mol. Mass.:
Description:
ASSAY_ID of EBI is 30109
Components:
This complex has 2 components.
Component 1
Name:
Integrin beta-3
Synonyms:
CD_antigen=CD61 GPIIIa ITGB3 Platelet membrane glycoprotein IIIa
Type:
Protein
Mol. Mass.:
87038.91
Organism:
Homo sapiens (Human)
Description:
P05106
Residue:
788
  
Component 2
Name:
Integrin alpha-IIb
Synonyms:
CD_antigen=CD41 GPIIb Glycoprotein IIb ITGA2B Integrin alpha-IIb heavy chain Integrin alpha-IIb light chain, form 2 Integrin alpha-V/beta-3 and alpha-IIb/beta 3 | Platelet membrane glycoprotein IIb
Type:
Protein
Mol. Mass.:
113354.85
Organism:
Homo sapiens (Human)
Description:
P08514
Residue:
1039
  
Inhibitor
Name:
BDBM50055896
Synonyms:
3-{2-[3-(4-Carbamimidoyl-phenyl)-4,5-dihydro-isoxazol-5-yl]-acetylamino}-propionic acid; TFA CHEMBL22599
Type:
Small organic molecule
Emp. Form.:
C15H18N4O4
Mol. Mass.:
318.3278
SMILES:
NC(=N)c1ccc(cc1)C1=NOC(CC(=O)NCCC(O)=O)C1
: