Target
Collagenase ColA
Ligand
BDBM50086765
Substrate
Meas. Tech.
ChEBML_49486
Ki
5400±n/a nM
Citation
 Scozzafava, ASupuran, CT Protease inhibitors: synthesis of clostridium histolyticum collagenase inhibitors incorporating sulfonyl-L-alanine hydroxamate moieties. Bioorg Med Chem Lett 10:499-502 (2000)  
Target
Name:
Collagenase ColA
Synonyms:
120 kDa collagenase Microbial collagenase | colA
Type:
PROTEIN
Mol. Mass.:
125901.02
Organism:
Clostridium perfringens
Description:
ChEMBL_49485
Residue:
1104
  
Inhibitor
Name:
BDBM50086765
Synonyms:
2-[3-(4-Fluoro-phenyl)-1-(4-nitro-benzyl)-ureido]-propionic acid | CHEMBL147931
Type:
Small organic molecule
Emp. Form.:
C17H16FN3O5
Mol. Mass.:
361.3244
SMILES:
CC(N(Cc1ccc(cc1)[N+]([O-])=O)C(=O)Nc1ccc(F)cc1)C(O)=O
: