Target
Adenosine receptor A2b
Ligand
BDBM10849
Substrate
Meas. Tech.
ChEMBL_1920203 (CHEMBL4423048)
Ki
10000±n/a nM
Citation
 Härter, MKalthof, BDelbeck, MLustig, KGerisch, MSchulz, SKast, RMeibom, DLindner, N Novel non-xanthine antagonist of the A Eur J Med Chem 163:763-778 (2019)  
Target
Name:
Adenosine receptor A2b
Synonyms:
AA2BR_HUMAN ADORA2B Adenosine receptors A2b | Adenosine receptors; A2a & A2b
Type:
G Protein-Coupled Receptor (GPCR)
Mol. Mass.:
36341.22
Organism:
Homo sapiens (Human)
Description:
Residue:
332
  
Inhibitor
Name:
BDBM10849
Synonyms:
1,3,7-trimethyl-2,3,6,7-tetrahydro-1H-purine-2,6-dione CHEMBL113 caffeine
Type:
Small organic molecule
Emp. Form.:
C8H10N4O2
Mol. Mass.:
194.1906
SMILES:
Cn1cnc2n(C)c(=O)n(C)c(=O)c12
: