Target
Tyrosine-protein phosphatase non-receptor type 1
Ligand
BDBM50086965
Substrate
Meas. Tech.
ChEMBL_161563 (CHEMBL768926)
IC50
100.0±n/a nM
Citation
 Malamas, MSSredy, JMoxham, CKatz, AXu, WMcDevitt, RAdebayo, FOSawicki, DRSeestaller, LSullivan, DTaylor, JR Novel benzofuran and benzothiophene biphenyls as inhibitors of protein tyrosine phosphatase 1B with antihyperglycemic properties. J Med Chem 43:1293-310 (2001)  
Target
Name:
Tyrosine-protein phosphatase non-receptor type 1
Synonyms:
PTN1_HUMAN PTPN1 Protein tyrosine phosphatase-1B (PTP1B) Protein-tyrosine phosphatase 1B (PTP1B) Tyrosine-protein phosphatase non-receptor type 1 (PTP1B)
Type:
Protein phosphatase
Mol. Mass.:
49963.76
Organism:
Homo sapiens (Human)
Description:
Human recombinant GST-fusion PTP1B (1-435).
Residue:
435
  
Inhibitor
Name:
BDBM50086965
Synonyms:
2-(4'-(2-benzylbenzo[b]thiophen-3-yl)-3,5-dibromobiphenyl-4-yloxy)acetic acid [4'-(2-Benzyl-benzo[b]thiophen-3-yl)-3,5-dibromo-biphenyl-4-yloxy]-acetic acid
Type:
Small organic molecule
Emp. Form.:
C29H20Br2O3S
Mol. Mass.:
608.34
SMILES:
OC(=O)COc1c(Br)cc(cc1Br)-c1ccc(cc1)-c1c(Cc2ccccc2)sc2ccccc12
: