Target
Tyrosine-protein phosphatase non-receptor type 1
Ligand
BDBM50086979
Substrate
Meas. Tech.
ChEMBL_161563 (CHEMBL768926)
IC50
1150±n/a nM
Citation
 Malamas, MSSredy, JMoxham, CKatz, AXu, WMcDevitt, RAdebayo, FOSawicki, DRSeestaller, LSullivan, DTaylor, JR Novel benzofuran and benzothiophene biphenyls as inhibitors of protein tyrosine phosphatase 1B with antihyperglycemic properties. J Med Chem 43:1293-310 (2001)  
Target
Name:
Tyrosine-protein phosphatase non-receptor type 1
Synonyms:
PTN1_HUMAN PTPN1 Protein tyrosine phosphatase-1B (PTP1B) Protein-tyrosine phosphatase 1B (PTP1B) Tyrosine-protein phosphatase non-receptor type 1 (PTP1B)
Type:
Protein phosphatase
Mol. Mass.:
49963.76
Organism:
Homo sapiens (Human)
Description:
Human recombinant GST-fusion PTP1B (1-435).
Residue:
435
  
Inhibitor
Name:
BDBM50086979
Synonyms:
CHEMBL279936 [4'-(2-Butyl-benzofuran-3-ylmethyl)-biphenyl-4-yloxy]-acetic acid
Type:
Small organic molecule
Emp. Form.:
C27H26O4
Mol. Mass.:
414.4929
SMILES:
CCCCc1oc2ccccc2c1Cc1ccc(cc1)-c1ccc(OCC(O)=O)cc1
: