Target
Adenosine deaminase
Ligand
BDBM50087293
Substrate
Meas. Tech.
ChEMBL_30801 (CHEMBL645077)
Ki
4700±n/a nM
Citation
 Bookser, BCKasibhatla, SRAppleman, JRErion, MD AMP deaminase inhibitors. 2. Initial discovery of a non-nucleotide transition-state inhibitor series. J Med Chem 43:1495-507 (2000)  
Target
Name:
Adenosine deaminase
Synonyms:
ADA Adenosine aminohydrolase
Type:
Enzyme
Mol. Mass.:
40910.44
Organism:
Bos taurus (bovine)
Description:
Residue:
363
  
Inhibitor
Name:
BDBM50087293
Synonyms:
3-(5-Hydroxy-pentyl)-3,6,7,8-tetrahydro-imidazo[4,5-d][1,3]diazepin-8-ol | CHEMBL34373
Type:
Small organic molecule
Emp. Form.:
C11H18N4O2
Mol. Mass.:
238.2862
SMILES:
OCCCCCn1cnc2C(O)CNC=Nc12
: