Target
AMP deaminase 2
Ligand
BDBM50087298
Substrate
Meas. Tech.
ChEMBL_28868 (CHEMBL644200)
Ki
2100±n/a nM
Citation
 Bookser, BCKasibhatla, SRAppleman, JRErion, MD AMP deaminase inhibitors. 2. Initial discovery of a non-nucleotide transition-state inhibitor series. J Med Chem 43:1495-507 (2000)  
Target
Name:
AMP deaminase 2
Synonyms:
AMP deaminase 2 AMPD2 | AMPD2_HUMAN
Type:
Protein
Mol. Mass.:
100694.77
Organism:
Homo sapiens (Human)
Description:
Residue:
879
  
Inhibitor
Name:
BDBM50087298
Synonyms:
6-(8-Hydroxy-7,8-dihydro-6H-imidazo[4,5-d][1,3]diazepin-3-yl)-2-phenyl-hexanoic acid 0.75H2O.0.27CH3CO2H | CHEMBL288348
Type:
Small organic molecule
Emp. Form.:
C18H22N4O3
Mol. Mass.:
342.3923
SMILES:
OC1CNC=Nc2c1ncn2CCCCC(C(O)=O)c1ccccc1
: