Target
Adenosine deaminase
Ligand
BDBM50087334
Substrate
Meas. Tech.
ChEMBL_30801 (CHEMBL645077)
Ki
280000±n/a nM
Citation
 Bookser, BCKasibhatla, SRAppleman, JRErion, MD AMP deaminase inhibitors. 2. Initial discovery of a non-nucleotide transition-state inhibitor series. J Med Chem 43:1495-507 (2000)  
Target
Name:
Adenosine deaminase
Synonyms:
ADA Adenosine aminohydrolase
Type:
Enzyme
Mol. Mass.:
40910.44
Organism:
Bos taurus (bovine)
Description:
Residue:
363
  
Inhibitor
Name:
BDBM50087334
Synonyms:
CHEMBL37028 | Sodium; 6-(8-hydroxy-7,8-dihydro-6H-imidazo[4,5-d][1,3]diazepin-3-yl)-hexanoate 0.5H2O
Type:
Small organic molecule
Emp. Form.:
C12H17N4O3
Mol. Mass.:
265.2889
SMILES:
OC1CNC=Nc2c1ncn2CCCCCC([O-])=O
: