Target
AMP deaminase 2
Ligand
BDBM50087325
Substrate
Meas. Tech.
ChEMBL_28868 (CHEMBL644200)
Ki
10000±n/a nM
Citation
 Bookser, BCKasibhatla, SRAppleman, JRErion, MD AMP deaminase inhibitors. 2. Initial discovery of a non-nucleotide transition-state inhibitor series. J Med Chem 43:1495-507 (2000)  
Target
Name:
AMP deaminase 2
Synonyms:
AMP deaminase 2 AMPD2 | AMPD2_HUMAN
Type:
Protein
Mol. Mass.:
100694.77
Organism:
Homo sapiens (Human)
Description:
Residue:
879
  
Inhibitor
Name:
BDBM50087325
Synonyms:
7-(8-Hydroxy-7,8-dihydro-6H-imidazo[4,5-d][1,3]diazepin-3-yl)-heptanoic acid 0.5H2O | CHEMBL37135
Type:
Small organic molecule
Emp. Form.:
C13H20N4O3
Mol. Mass.:
280.3229
SMILES:
OC1CNC=Nc2c1ncn2CCCCCCC(O)=O
: