Target
Adenosine deaminase
Ligand
BDBM50087372
Substrate
Meas. Tech.
ChEMBL_30792 (CHEMBL873051)
Ki
40±n/a nM
Citation
 Kasibhatla, SRBookser, BCProbst, GAppleman, JRErion, MD AMP deaminase inhibitors. 3. SAR of 3-(carboxyarylalkyl)coformycin aglycon analogues. J Med Chem 43:1508-18 (2000)  
Target
Name:
Adenosine deaminase
Synonyms:
ADA Adenosine aminohydrolase
Type:
Enzyme
Mol. Mass.:
40910.44
Organism:
Bos taurus (bovine)
Description:
Residue:
363
  
Inhibitor
Name:
BDBM50087372
Synonyms:
2-[3-(8-Hydroxy-7,8-dihydro-6H-imidazo[4,5-d][1,3]diazepin-3-yl)-propyl]-5-methyl-benzoic acid methyl ester (0.15H2O) | CHEMBL35777
Type:
Small organic molecule
Emp. Form.:
C18H22N4O3
Mol. Mass.:
342.3923
SMILES:
COC(=O)c1cc(C)ccc1CCCn1cnc2C(O)CNC=Nc12
: