Target
Beta-1 adrenergic receptor
Ligand
BDBM50019059
Substrate
Meas. Tech.
ChEMBL_37540 (CHEMBL647622)
Ki
1800±n/a nM
Citation
 Lu, SFHerbert, BHaufe, GLaue, KWPadgett, WLOshunleti, ODaly, JWKirk, KL Syntheses of (R)- and (S)-2- and 6-fluoronorepinephrine and (R)- and (S)-2- and 6-fluoroepinephrine: effect of stereochemistry on fluorine-induced adrenergic selectivities. J Med Chem 43:1611-9 (2000)  
Target
Name:
Beta-1 adrenergic receptor
Synonyms:
ADRB1R, B1AR Adrb1 Adrenergic receptor beta Beta-1 adrenoreceptor adrenergic Beta1,2
Type:
Protein
Mol. Mass.:
50486.84
Organism:
Rattus norvegicus (Rat)
Description:
P18090
Residue:
466
  
Inhibitor
Name:
BDBM50019059
Synonyms:
(+/-)3-Fluoro-4-(1-hydroxy-2-methylamino-ethyl)-benzene-1,2-diol 3-Fluoro-4-(1-hydroxy-2-methylamino-ethyl)-benzene-1,2-diol(2-FEPI) | CHEMBL43711
Type:
Small organic molecule
Emp. Form.:
C9H12FNO3
Mol. Mass.:
201.1949
SMILES:
CNCC(O)c1ccc(O)c(O)c1F
: