Target
Genome polyprotein
Ligand
BDBM50087787
Substrate
Meas. Tech.
ChEMBL_160903 (CHEMBL771799)
Ki
104000±n/a nM
Citation
 Reich, SHJohnson, TWallace, MBKephart, SEFuhrman, SAWorland, STMatthews, DAHendrickson, TFChan, FMeador, JFerre, RABrown, ELDeLisle, DMPatick, AKBinford, SLFord, CE Substituted benzamide inhibitors of human rhinovirus 3C protease: structure-based design, synthesis, and biological evaluation. J Med Chem 43:1670-83 (2000)  
Target
Name:
Genome polyprotein
Synonyms:
Human rhinovirus A protease | Human rhinovirus B 3A protease
Type:
PROTEIN
Mol. Mass.:
44361.04
Organism:
Human rhinovirus B
Description:
ChEMBL_158953
Residue:
401
  
Inhibitor
Name:
BDBM50087787
Synonyms:
3-Formyl-benzamide | CHEMBL43885
Type:
Small organic molecule
Emp. Form.:
C8H7NO2
Mol. Mass.:
149.1467
SMILES:
NC(=O)c1cccc(C=O)c1
: