Target
Amine oxidase [flavin-containing] B
Ligand
BDBM50087791
Substrate
Meas. Tech.
ChEMBL_124404 (CHEMBL878130)
Ki
370±n/a nM
Citation
 Morón, JACampillo, MPerez, VUnzeta, MPardo, L Molecular determinants of MAO selectivity in a series of indolylmethylamine derivatives: biological activities, 3D-QSAR/CoMFA analysis, and computational simulation of ligand recognition. J Med Chem 43:1684-91 (2000)  
Target
Name:
Amine oxidase [flavin-containing] B
Synonyms:
AOFB_RAT Amine oxidase [flavin-containing] B Monoamine Oxidase Type B (MAO-B) Monoamine oxidase B (MAO-B) Monoamine oxidase type B (MAOB) | Monoamine oxidase-B (MAO-B)
Type:
Enzyme
Mol. Mass.:
58469.65
Organism:
Rattus norvegicus (rat)
Description:
P19643
Residue:
520
  
Inhibitor
Name:
BDBM50087791
Synonyms:
But-2-ynyl-(5-methoxy-1-methyl-1H-indol-2-ylmethyl)-methyl-amine (FA45) | CHEMBL44433
Type:
Small organic molecule
Emp. Form.:
C16H20N2O
Mol. Mass.:
256.3428
SMILES:
COc1ccc2n(C)c(CN(C)CC#CC)cc2c1
: