Target
Amine oxidase [flavin-containing] A
Ligand
BDBM50087795
Substrate
Meas. Tech.
ChEMBL_123446 (CHEMBL731837)
Ki
4000±n/a nM
Citation
 Morón, JACampillo, MPerez, VUnzeta, MPardo, L Molecular determinants of MAO selectivity in a series of indolylmethylamine derivatives: biological activities, 3D-QSAR/CoMFA analysis, and computational simulation of ligand recognition. J Med Chem 43:1684-91 (2000)  
Target
Name:
Amine oxidase [flavin-containing] A
Synonyms:
AOFA_RAT Amine oxidase [flavin-containing] A Monoamine Oxidase Type A (MAO-A) Monoamine oxidase A (MAO-A) Monoamine oxidase type A (MAOA)
Type:
Enzyme
Mol. Mass.:
59515.21
Organism:
Rattus norvegicus (rat)
Description:
Residue:
526
  
Inhibitor
Name:
BDBM50087795
Synonyms:
1-Methyl-2-prop-2-ynylaminomethyl-1H-indol-5-ol (FA102) | CHEMBL44389
Type:
Small organic molecule
Emp. Form.:
C13H14N2O
Mol. Mass.:
214.2631
SMILES:
Cn1c(CNCC#C)cc2cc(O)ccc12
: