Target
Substance-P receptor
Ligand
BDBM50087851
Substrate
Meas. Tech.
ChEMBL_216194 (CHEMBL818921)
EC50
0.6±n/a nM
Citation
 Perrine, SAWhitehead, TLHicks, RPSzarek, JLKrause, JESimmons, MA Solution structures in SDS micelles and functional activity at the bullfrog substance P receptor of ranatachykinin peptides. J Med Chem 43:1741-53 (2000)  
Target
Name:
Substance-P receptor
Synonyms:
NK-1 receptor NK1 Receptor NK1R_HUMAN Neurokinin-1 (NK-1) SPR TACR1 Tachykinin receptor 1 (NK1) | tachykinin
Type:
G Protein-Coupled Receptor (GPCR)
Mol. Mass.:
46254.43
Organism:
Homo sapiens (Human)
Description:
P25103
Residue:
407
  
Inhibitor
Name:
BDBM50087851
Synonyms:
CHEMBL384518 | LysProSerProAspArgPheTyrGlyLeuMet
Type:
Small organic molecule
Emp. Form.:
C60H92N16O15S
Mol. Mass.:
1309.536
SMILES:
CSCC[C@H](NC(=O)[C@H](CC(C)C)NC(=O)CNC(=O)[C@H](Cc1ccc(O)cc1)NC(=O)[C@H](Cc1ccccc1)NC(=O)[C@H](CCCNC(N)=N)NC(=O)[C@H](CC(O)=O)NC(=O)[C@@H]1CCCN1C(=O)[C@H](CO)NC(=O)[C@@H]1CCCN1C(=O)[C@@H](N)CCCCN)C(N)=O
: