Target
High affinity cGMP-specific 3',5'-cyclic phosphodiesterase 9A
Ligand
BDBM50027176
Substrate
Meas. Tech.
ChEMBL_1922378 (CHEMBL4425334)
IC50
>200000±n/a nM
Citation
 Jansen, CKooistra, AJKanev, GKLeurs, Rde Esch, IJde Graaf, C PDEStrIAn: A Phosphodiesterase Structure and Ligand Interaction Annotated Database As a Tool for Structure-Based Drug Design. J Med Chem 59:7029-65 (2016)  
Target
Name:
High affinity cGMP-specific 3',5'-cyclic phosphodiesterase 9A
Synonyms:
3',5'-cyclic phosphodiesterase PDE9A_HUMAN Phosphodiesterase 9A (PDE9) | Phosphodiesterase 9A (PDE9A)
Type:
Protein
Mol. Mass.:
68488.40
Organism:
Homo sapiens (Human)
Description:
O76083
Residue:
593
  
Inhibitor
Name:
BDBM50027176
Synonyms:
2-Acetoxy-Benzoic Acid CHEBI:34795 | ISOBUTYLMETHYLXANTHINE
Type:
Small organic molecule
Emp. Form.:
C10H14N4O2
Mol. Mass.:
222.2438
SMILES:
CC(C)Cn1c2[nH]cnc2c(=O)n(C)c1=O
: