Target
A disintegrin and metalloproteinase with thrombospondin motifs 5
Ligand
BDBM50238243
Substrate
Meas. Tech.
ChEMBL_1922601 (CHEMBL4425557)
IC50
5.0±n/a nM
Citation
 Wiley, MRDurham, TBAdams, LAChambers, MGLin, CLiu, CMarimuthu, JMitchell, PGMudra, DRSwearingen, CAToth, JLWeller, JMThirunavukkarasu, K Use of Osmotic Pumps to Establish the Pharmacokinetic-Pharmacodynamic Relationship and Define Desirable Human Performance Characteristics for Aggrecanase Inhibitors. J Med Chem 59:5810-22 (2016)  
Target
Name:
A disintegrin and metalloproteinase with thrombospondin motifs 5
Synonyms:
A disintegrin and metalloproteinase with thrombospondin motifs 5 (ADAMTS-5) ADAMTS5 ATS5_HUMAN Metalloproteinase with thrombospondin motifs 5 (ADAMTS-5)
Type:
Enzyme
Mol. Mass.:
101769.09
Organism:
Homo sapiens (Human)
Description:
Q9UNA0
Residue:
930
  
Inhibitor
Name:
BDBM50238243
Synonyms:
CHEMBL4097165
Type:
Small organic molecule
Emp. Form.:
C17H14F3N3O4
Mol. Mass.:
381.306
SMILES:
FC(F)(F)c1ccc2oc(cc2c1)C(=O)NC[C@]1(NC(=O)NC1=O)C1CC1
: