Target
Glutamate receptor ionotropic, kainate 5
Ligand
BDBM50002369
Substrate
Meas. Tech.
ChEMBL_90601 (CHEMBL701557)
Ki
8±n/a nM
Citation
 Pedregal, CCollado, IEscribano, AEzquerra, JDomínguez, CMateo, AIRubio, ABaker, SRGoldsworthy, JKamboj, RKBallyk, BAHoo, KBleakman, D 4-Alkyl- and 4-cinnamylglutamic acid analogues are potent GluR5 kainate receptor agonists. J Med Chem 43:1958-68 (2000)  
Target
Name:
Glutamate receptor ionotropic, kainate 5
Synonyms:
GRIK2 GRIK5_HUMAN Glutamate receptor, ionotropic kainate 5 Ionotropic glutamate receptor kainate 2/5
Type:
Enzyme Catalytic Domain
Mol. Mass.:
109280.81
Organism:
Homo sapiens (Human)
Description:
Glutamate-Kainate 5 Grik5 HUMAN::Q16478
Residue:
980
  
Inhibitor
Name:
BDBM50002369
Synonyms:
(2S-(2alpha,3beta,4beta))-2-carboxy-4-(1-methylethenyl)-3-pyrrolidineacetic acid CHEMBL275040 Digensaeure Kainate L-alpha-kainic acid digenic acid | kainic acid
Type:
Small organic molecule
Emp. Form.:
C10H15NO4
Mol. Mass.:
213.2304
SMILES:
CC(=C)[C@H]1CN[C@@H]([C@H]1CC(O)=O)C(O)=O
: