Target
Glutamate receptor ionotropic, kainate 1
Ligand
BDBM26431
Substrate
Meas. Tech.
ChEMBL_90433 (CHEMBL697422)
EC50
75000±n/a nM
Citation
 Pedregal, CCollado, IEscribano, AEzquerra, JDomínguez, CMateo, AIRubio, ABaker, SRGoldsworthy, JKamboj, RKBallyk, BAHoo, KBleakman, D 4-Alkyl- and 4-cinnamylglutamic acid analogues are potent GluR5 kainate receptor agonists. J Med Chem 43:1958-68 (2000)  
Target
Name:
Glutamate receptor ionotropic, kainate 1
Synonyms:
GLUR5 GRIK1_HUMAN Glutamate kainate Glutamate receptor ionotropic kainate 1 Glutamate-Kainate Grik1 protein | hmglur5 flipr
Type:
Enzyme Catalytic Domain
Mol. Mass.:
103984.96
Organism:
Homo sapiens (Human)
Description:
P39086
Residue:
918
  
Inhibitor
Name:
BDBM26431
Synonyms:
(2R)-2-aminopentanedioic acid D-Glu D-[14C]Glu
Type:
radiolabeled amino acid
Emp. Form.:
C5H9NO4
Mol. Mass.:
147.1293
SMILES:
N[C@H](CCC(O)=O)C(O)=O
: