Target
Alpha-1A adrenergic receptor
Ligand
BDBM50088408
Substrate
Meas. Tech.
ChEMBL_33612 (CHEMBL652819)
Ki
1.47±n/a nM
Citation
 Kuo, GHProuty, CMurray, WVPulito, VJolliffe, LCheung, PVarga, SEvangelisto, MWang, J Design, synthesis, and structure-activity relationships of phthalimide-phenylpiperazines: a novel series of potent and selective alpha(1)(a)-adrenergic receptor antagonists. J Med Chem 43:2183-95 (2000)  
Target
Name:
Alpha-1A adrenergic receptor
Synonyms:
ADA1A_HUMAN ADRA1C Alpha 1A-adrenoceptor Alpha adrenergic receptor 1a Alpha-adrenergic receptor 1c adrenergic Alpha1 | adrenergic Alpha1C
Type:
Cell-surface receptors
Mol. Mass.:
51511.67
Organism:
Homo sapiens (Human)
Description:
P35348
Residue:
466
  
Inhibitor
Name:
BDBM50088408
Synonyms:
2-(2-Methoxy-phenyl)-1,3-dioxo-2,3-dihydro-1H-isoindole-5-carboxylic acid {2-hydroxy-3-[4-(2-isopropoxy-phenyl)-piperazin-1-yl]-propyl}-amide | CHEMBL68565
Type:
Small organic molecule
Emp. Form.:
C32H36N4O6
Mol. Mass.:
572.6514
SMILES:
COc1ccccc1N1C(=O)c2ccc(cc2C1=O)C(=O)NCC(O)CN1CCN(CC1)c1ccccc1OC(C)C
: