Target
P2Y purinoceptor 11
Ligand
BDBM50456168
Substrate
Meas. Tech.
ChEMBL_1923541 (CHEMBL4426497)
IC50
>10000±n/a nM
Citation
 Junker, ABalasubramanian, RCiancetta, AUliassi, EKiselev, EMartiriggiano, CTrujillo, KMtchedlidze, GBirdwell, LBrown, KAHarden, TKJacobson, KA Structure-Based Design of 3-(4-Aryl-1H-1,2,3-triazol-1-yl)-Biphenyl Derivatives as P2Y14 Receptor Antagonists. J Med Chem 59:6149-68 (2016)  
Target
Name:
P2Y purinoceptor 11
Synonyms:
P2RY11 P2Y11 Purinergic receptor P2Y11
Type:
PROTEIN
Mol. Mass.:
40366.02
Organism:
Homo sapiens (Human)
Description:
ChEMBL_1362532
Residue:
374
  
Inhibitor
Name:
BDBM50456168
Synonyms:
CHEMBL1800685
Type:
Small organic molecule
Emp. Form.:
C29H24F3NO2
Mol. Mass.:
475.5016
SMILES:
OC(=O)c1cc(-c2ccc(cc2)C2CCNCC2)c2ccc(cc2c1)-c1ccc(cc1)C(F)(F)F
: