Target
Prothrombin
Ligand
BDBM50088652
Substrate
Meas. Tech.
ChEBML_209048
Ki
0.400000±n/a nM
Citation
 Coburn, CARush, DMWilliams, PDHomnick, CLyle, EALewis, SDLucas, BJDi Muzio-Mower, JMJuliano, MKrueger, JAVastag, KChen, IWVacca, JP Bicyclic pyridones as potent, efficacious and orally bioavailable thrombin inhibitors. Bioorg Med Chem Lett 10:1069-72 (2000)  
Target
Name:
Prothrombin
Synonyms:
Activation peptide fragment 1 Coagulation factor II Prothrombin precursor Thrombin heavy chain | Thrombin light chain
Type:
Protein
Mol. Mass.:
70029.57
Organism:
Homo sapiens (Human)
Description:
P00734
Residue:
622
  
Inhibitor
Name:
BDBM50088652
Synonyms:
CHEMBL275520 | N-(6-Amino-2-methyl-pyridin-3-ylmethyl)-2-((R)-3-isobutyl-6-methyl-2,8-dioxo-2,3,4,8-tetrahydro-1H-[1,7]naphthyridin-7-yl)-acetamide
Type:
Small organic molecule
Emp. Form.:
C22H29N5O3
Mol. Mass.:
411.4974
SMILES:
CC(C)C[C@@H]1Cc2cc(C)n(CC(=O)NCc3ccc(N)nc3C)c(=O)c2NC1=O
: