Target
5-hydroxytryptamine receptor 1A
Ligand
BDBM50088686
Substrate
Meas. Tech.
ChEBML_1153
Ki
0.260000±n/a nM
Citation
 Modica, MSantagati, MSantagati, ARusso, FCagnotto, AGoegan, MMennini, T High potent and selective arylpiperazine derivatives as ligands for the 5-HT1A receptor. Bioorg Med Chem Lett 10:1089-92 (2000)  
Target
Name:
5-hydroxytryptamine receptor 1A
Synonyms:
5-HT-1A 5-HT1A 5-hydroxytryptamine receptor 1A (5HT1A) 5ht1a Htr1a Serotonin 1a (5-HT1a) receptor/Adrenergic receptor alpha-1 | Serotonin receptor 1A
Type:
G Protein-Coupled Receptor (GPCR)
Mol. Mass.:
46445.29
Organism:
Rattus norvegicus (rat)
Description:
Binding assays were performed using rat hippocampal membranes.
Residue:
422
  
Inhibitor
Name:
BDBM50088686
Synonyms:
3-Amino-2-{3-[4-(2-methoxy-phenyl)-piperazin-1-yl]-propylsulfanyl}-3,5,6,7-tetrahydro-cyclopenta[4,5]thieno[2,3-d]pyrimidin-4-one | CHEMBL12170
Type:
Small organic molecule
Emp. Form.:
C23H29N5O2S2
Mol. Mass.:
471.639
SMILES:
COc1ccccc1N1CCN(CCCSc2nc3sc4CCCc4c3c(=O)n2N)CC1
: