Target
Beta-lactamase
Ligand
BDBM50033680
Substrate
Meas. Tech.
ChEBML_47848
IC50
6560±n/a nM
Citation
 Buynak, JDDoppalapudi, VRRao, ASNidamarthy, SDAdam, G The synthesis and evaluation of 2-substituted-7-(alkylidene)cephalosporin sulfones as beta-lactamase inhibitors. Bioorg Med Chem Lett 10:847-51 (2000)  
Target
Name:
Beta-lactamase
Synonyms:
Beta-lactamase class C
Type:
PROTEIN
Mol. Mass.:
41618.07
Organism:
Enterobacter cloacae
Description:
ChEMBL_47855
Residue:
384
  
Inhibitor
Name:
BDBM50033680
Synonyms:
CHEMBL268919 | Sodium; (R)-3-acetoxymethyl-7-[1-tert-butoxycarbonyl-meth-(Z)-ylidene]-5,5,8-trioxo-5lambda*6*-thia-1-aza-bicyclo[4.2.0]oct-2-ene-2-carboxylate
Type:
Small organic molecule
Emp. Form.:
C16H18NO9S
Mol. Mass.:
400.381
SMILES:
CC(=O)OCC1=C(N2[C@@H](\C(=C/C(=O)OC(C)(C)C)C2=O)S(=O)(=O)C1)C([O-])=O
: