Target
Beta-lactamase
Ligand
BDBM50088816
Substrate
Meas. Tech.
ChEBML_47843
IC50
1400±n/a nM
Citation
 Buynak, JDDoppalapudi, VRAdam, G The synthesis and evaluation of 3-substituted-7-(alkylidene)cephalosporin sulfones as beta-lactamase inhibitors. Bioorg Med Chem Lett 10:853-7 (2000)  
Target
Name:
Beta-lactamase
Synonyms:
BLAC_STAAU Penicillinase | blaZ
Type:
PROTEIN
Mol. Mass.:
31367.53
Organism:
Staphylococcus aureus
Description:
ChEMBL_41052
Residue:
281
  
Inhibitor
Name:
BDBM50088816
Synonyms:
CHEMBL167539 | Sodium; 3-((Z)-2-chloro-2-methoxycarbonyl-vinyl)-5,5,8-trioxo-7-[1-pyridin-2-yl-meth-(Z)-ylidene]-5lambda*6*-thia-1-aza-bicyclo[4.2.0]oct-2-ene-2-carboxylate
Type:
Small organic molecule
Emp. Form.:
C17H12ClN2O7S
Mol. Mass.:
423.805
SMILES:
COC(=O)C(\Cl)=C\C1=C(N2C(\C(=C/c3ccccn3)C2=O)S(=O)(=O)C1)C([O-])=O
: