Target
Beta-lactamase
Ligand
BDBM50088831
Substrate
Meas. Tech.
ChEBML_47837
IC50
90±n/a nM
Citation
 Buynak, JDDoppalapudi, VRAdam, G The synthesis and evaluation of 3-substituted-7-(alkylidene)cephalosporin sulfones as beta-lactamase inhibitors. Bioorg Med Chem Lett 10:853-7 (2000)  
Target
Name:
Beta-lactamase
Synonyms:
Beta-lactamase TEM
Type:
PROTEIN
Mol. Mass.:
31512.33
Organism:
Enterobacter cloacae
Description:
ChEMBL_41358
Residue:
286
  
Inhibitor
Name:
BDBM50088831
Synonyms:
CHEMBL353613 | Sodium; 3-((E)-2-carbamoyl-vinyl)-5,5,8-trioxo-7-[1-pyridin-2-yl-meth-(Z)-ylidene]-5lambda*6*-thia-1-aza-bicyclo[4.2.0]oct-2-ene-2-carboxylate
Type:
Small organic molecule
Emp. Form.:
C16H12N3O6S
Mol. Mass.:
374.349
SMILES:
NC(=O)\C=C\C1=C(N2C(\C(=C/c3ccccn3)C2=O)S(=O)(=O)C1)C([O-])=O
: