Target
5-hydroxytryptamine receptor 1D
Ligand
BDBM50088869
Substrate
Meas. Tech.
ChEBML_1733
Ki
2.5±n/a nM
Citation
 Meng, CQRakhit, SLee, DKKamboj, RMcCallum, KLMazzocco, LDyne, KSlassi, A 5-Thienyltryptamine derivatives as serotonin 5-HT1B/1D receptor agonists: potential treatments for migraine. Bioorg Med Chem Lett 10:903-5 (2000)  
Target
Name:
5-hydroxytryptamine receptor 1D
Synonyms:
5-HT-1D 5-HT1D 5HT1D_HUMAN HTR1DA Serotonin (5-HT) receptor | Serotonin Receptor 1D
Type:
G Protein-Coupled Receptor (GPCR)
Mol. Mass.:
41920.63
Organism:
Homo sapiens (Human)
Description:
Receptor binding assays were performed using human clone stably expressed in CHO cells.
Residue:
377
  
Inhibitor
Name:
BDBM50088869
Synonyms:
3-[2-(2,5-Dimethyl-pyrrolidin-1-yl)-ethyl]-5-thiophen-2-yl-1H-indole | CHEMBL173656
Type:
Small organic molecule
Emp. Form.:
C20H24N2S
Mol. Mass.:
324.483
SMILES:
CC1CCC(C)N1CCc1c[nH]c2ccc(cc12)-c1cccs1
: