Target
Proto-oncogene tyrosine-protein kinase Src
Ligand
BDBM50088905
Substrate
Meas. Tech.
ChEMBL_216859 (CHEMBL816696)
IC50
10±n/a nM
Citation
 Missbach, MAltmann, EWidler, LSusa, MBuchdunger, EMett, HMeyer, TGreen, J Substituted 5,7-diphenyl-pyrrolo[2,3d]pyrimidines: potent inhibitors of the tyrosine kinase c-Src. Bioorg Med Chem Lett 10:945-9 (2000)  
Target
Name:
Proto-oncogene tyrosine-protein kinase Src
Synonyms:
Proto-oncogene c-Src SRC_CHICK c-Src p60c-src | pp60c-src
Type:
Tyr protein kinase
Mol. Mass.:
60015.36
Organism:
Gallus gallus (Chicken)
Description:
P00523
Residue:
533
  
Inhibitor
Name:
BDBM50088905
Synonyms:
2-(3-(4-amino-5-phenyl-7H-pyrrolo[2,3-d]pyrimidin-7-yl)benzylamino)ethanol CHEMBL176702
Type:
Small organic molecule
Emp. Form.:
C21H21N5O
Mol. Mass.:
359.4243
SMILES:
Nc1ncnc2n(cc(-c3ccccc3)c12)-c1cccc(CNCCO)c1
: