Target
Tyrosine-protein kinase CSK
Ligand
BDBM50088905
Substrate
Meas. Tech.
ChEBML_225999
IC50
5000±n/a nM
Citation
 Missbach, MAltmann, EWidler, LSusa, MBuchdunger, EMett, HMeyer, TGreen, J Substituted 5,7-diphenyl-pyrrolo[2,3d]pyrimidines: potent inhibitors of the tyrosine kinase c-Src. Bioorg Med Chem Lett 10:945-9 (2000)  
Target
Name:
Tyrosine-protein kinase CSK
Synonyms:
C-SRC kinase CSK Protein-tyrosine kinase CYL | Tyrosine Kinase CSK
Type:
Tyrosine-protein kinase
Mol. Mass.:
50707.30
Organism:
Homo sapiens (Human)
Description:
P41240
Residue:
450
  
Inhibitor
Name:
BDBM50088905
Synonyms:
2-(3-(4-amino-5-phenyl-7H-pyrrolo[2,3-d]pyrimidin-7-yl)benzylamino)ethanol CHEMBL176702
Type:
Small organic molecule
Emp. Form.:
C21H21N5O
Mol. Mass.:
359.4243
SMILES:
Nc1ncnc2n(cc(-c3ccccc3)c12)-c1cccc(CNCCO)c1
: