Target
Glutathione S-transferase A2
Ligand
BDBM50088966
Substrate
Meas. Tech.
ChEBML_72327
IC50
19100±n/a nM
Citation
 Brophy, PMCampbell, AMvan Eldik, AJTeesdale-Spittle, PHLiebau, EWang, MF Beta-carbonyl substituted glutathione conjugates as inhibitors Of O. volvulus GST2. Bioorg Med Chem Lett 10:979-81 (2000)  
Target
Name:
Glutathione S-transferase A2
Synonyms:
GST class-alpha member 2 GST2 GSTA2-2 GTH2 | HA subunit 2
Type:
PROTEIN
Mol. Mass.:
25667.17
Organism:
Homo sapiens (Human)
Description:
ChEMBL_799590
Residue:
222
  
Inhibitor
Name:
BDBM50088966
Synonyms:
2-[2-(4-Amino-4-carboxy-butyrylamino)-2-(carboxymethyl-carbamoyl)-ethylsulfanyl]-succinic acid | CHEMBL177327
Type:
Small organic molecule
Emp. Form.:
C14H21N3O10S
Mol. Mass.:
423.396
SMILES:
NC(CCC(=O)NC(CSC(CC(O)=O)C(O)=O)C(=O)NCC(O)=O)C(O)=O
: