Target
Glutathione S-transferase A2
Ligand
BDBM50088971
Substrate
Meas. Tech.
ChEBML_72327
IC50
41000±n/a nM
Citation
 Brophy, PMCampbell, AMvan Eldik, AJTeesdale-Spittle, PHLiebau, EWang, MF Beta-carbonyl substituted glutathione conjugates as inhibitors Of O. volvulus GST2. Bioorg Med Chem Lett 10:979-81 (2000)  
Target
Name:
Glutathione S-transferase A2
Synonyms:
GST class-alpha member 2 GST2 GSTA2-2 GTH2 | HA subunit 2
Type:
PROTEIN
Mol. Mass.:
25667.17
Organism:
Homo sapiens (Human)
Description:
ChEMBL_799590
Residue:
222
  
Inhibitor
Name:
BDBM50088971
Synonyms:
2-Amino-4-[1-(carboxymethyl-carbamoyl)-2-(3-oxo-1-phenyl-butylsulfanyl)-ethylcarbamoyl]-butyric acid | CHEMBL441308
Type:
Small organic molecule
Emp. Form.:
C20H27N3O7S
Mol. Mass.:
453.509
SMILES:
CC(=O)CC(SCC(NC(=O)CCC(N)C(O)=O)C(=O)NCC(O)=O)c1ccccc1
: