Target
Tissue-type plasminogen activator
Ligand
BDBM50088981
Substrate
Meas. Tech.
ChEBML_207872
IC50
>2500±n/a nM
Citation
 Tamura, SYWeinhouse, MIRoberts, CAGoldman, EAMasukawa, KAnderson, SMCohen, CRBradbury, AEBernardino, VTDixon, SAMa, MGNolan, TGBrunck, TK Synthesis and biological activity of peptidyl aldehyde urokinase inhibitors. Bioorg Med Chem Lett 10:983-7 (2000)  
Target
Name:
Tissue-type plasminogen activator
Synonyms:
Alteplase Reteplase Thrombin receptor protein Tissue-type plasminogen activator (tPA) t-PA t-plasminogen activator
Type:
Enzyme
Mol. Mass.:
62931.08
Organism:
Homo sapiens (Human)
Description:
Residue:
562
  
Inhibitor
Name:
BDBM50088981
Synonyms:
CHEMBL425850 | {1-[1-(1-Carbamimidoyl-2-hydroxy-piperidin-3-ylcarbamoyl)-ethylcarbamoyl]-2-hydroxy-propyl}-carbamic acid benzyl ester
Type:
Small organic molecule
Emp. Form.:
C21H32N6O6
Mol. Mass.:
464.5154
SMILES:
CC(O)[C@@H](NC(=O)OCc1ccccc1)C(=O)N[C@@H](C)C(=O)N[C@H]1CCCN(C1O)C(N)=N
: