Target
Integrin alpha-4/beta-1
Ligand
BDBM50089015
Substrate
Meas. Tech.
ChEMBL_217452 (CHEMBL823501)
IC50
76570±n/a nM
Citation
 Archibald, SCHead, JCGozzard, NHowat, DWParton, TAPorter, JRRobinson, MKShock, AWarrellow, GJAbraham, WM Discovery and evaluation of potent, tyrosine-based alpha4beta1 integrin antagonists. Bioorg Med Chem Lett 10:997-9 (2000)  
Target
Name:
Integrin alpha-4/beta-1
Synonyms:
Fibronectin receptor beta/Integrin alpha-4 | Integrin alpha-4/beta-1
Type:
Mol. Mass.:
Description:
ASSAY_ID of EBI is 88912
Components:
This complex has 2 components.
Component 1
Name:
Integrin beta-1
Synonyms:
CD_antigen=CD29 Fibronectin receptor beta GPIIA ITGB1 MDF2 | MSK12
Type:
Enzyme
Mol. Mass.:
88400.38
Organism:
Homo sapiens (Human)
Description:
P05556
Residue:
798
  
Component 2
Name:
Integrin alpha-4
Synonyms:
CD49 antigen-like family member D CD49d antigen ITA4_HUMAN Integrin alpha-4 Integrin alpha-IV VLA-4 integrin alpha 4 precursor | integrin alpha-4 precursor
Type:
Membrane Protein
Mol. Mass.:
114897.35
Organism:
Homo sapiens (Human)
Description:
P13612
Residue:
1032
  
Inhibitor
Name:
BDBM50089015
Synonyms:
(S)-2-[((R)-3-Acetyl-thiazolidine-4-carbonyl)-amino]-3-(4-methoxy-phenyl)-propionic acid | CHEMBL366857
Type:
Small organic molecule
Emp. Form.:
C16H20N2O5S
Mol. Mass.:
352.405
SMILES:
COc1ccc(C[C@H](NC(=O)[C@@H]2CSCN2C(C)=O)C(O)=O)cc1
: