Target
Presenilin-1
Ligand
BDBM50241259
Substrate
Meas. Tech.
ChEMBL_1925279 (CHEMBL4428351)
IC50
0.080000±n/a nM
Citation
 Kumar, RJuillerat-Jeanneret, LGolshayan, D Notch Antagonists: Potential Modulators of Cancer and Inflammatory Diseases. J Med Chem 59:7719-37 (2016)  
Target
Name:
Presenilin-1
Synonyms:
3.4.23.- Gamma-Secretase Subunit Presenilin-1 PS1 PSEN1 PSNL1 Presenilin-1 CTF12 Protein S182
Type:
Mol. Mass.:
52657.13
Organism:
Homo sapiens (Human)
Description:
P49768
Residue:
467
  
Inhibitor
Name:
BDBM50241259
Synonyms:
(2S)-2-((S)-2-(3,5-difluorophenyl)-2-hydroxyacetamido)-N-((7S)-5-methyl-6-oxo-6,7-dihydro-5H-dibenzo[b,d]azepin-7-yl)propanamide CHEMBL392068 | LY-411575
Type:
Small organic molecule
Emp. Form.:
C26H23F2N3O4
Mol. Mass.:
479.4753
SMILES:
C[C@H](NC(=O)[C@@H](O)c1cc(F)cc(F)c1)C(=O)N[C@H]1c2ccccc2-c2ccccc2N(C)C1=O
: