Target
Presenilin-1
Ligand
BDBM50533417
Substrate
Meas. Tech.
ChEMBL_1925272 (CHEMBL4428344)
EC50
5.0±n/a nM
Citation
 Kumar, RJuillerat-Jeanneret, LGolshayan, D Notch Antagonists: Potential Modulators of Cancer and Inflammatory Diseases. J Med Chem 59:7719-37 (2016)  
Target
Name:
Presenilin-1
Synonyms:
3.4.23.- Gamma-Secretase Subunit Presenilin-1 PS1 PSEN1 PSNL1 Presenilin-1 CTF12 Protein S182
Type:
Mol. Mass.:
52657.13
Organism:
Homo sapiens (Human)
Description:
P49768
Residue:
467
  
Inhibitor
Name:
BDBM50533417
Synonyms:
RO 4929097 Rg 4733 Ro4929097
Type:
Small organic molecule
Emp. Form.:
C22H20F5N3O3
Mol. Mass.:
469.4045
SMILES:
CC(C)(C(=O)NCC(F)(F)C(F)(F)F)C(=O)N[C@H]1c2ccccc2-c2ccccc2NC1=O
: