Target
Metabotropic glutamate receptor 7
Ligand
BDBM50004881
Substrate
Meas. Tech.
ChEMBL_219039 (CHEMBL821295)
EC50
48000±n/a nM
Citation
 Gasparini, FInderbitzin, WFrancotte, ELecis, GRichert, PDragic, ZKuhn, RFlor, PJ (+)-4-phosphonophenylglycine (PPG) a new group III selective metabotropic glutamate receptor agonist. Bioorg Med Chem Lett 10:1241-4 (2000)  
Target
Name:
Metabotropic glutamate receptor 7
Synonyms:
GPRC1G GRM7 protein MGLUR7 metabotropic glutamate 7
Type:
Enzyme Catalytic Domain
Mol. Mass.:
102262.98
Organism:
Homo sapiens (Human)
Description:
Q14831
Residue:
915
  
Inhibitor
Name:
BDBM50004881
Synonyms:
(RS) PPG Amino-(4-phosphono-phenyl)-acetic acid(RS-PPG) PPG
Type:
Small organic molecule
Emp. Form.:
C8H10NO5P
Mol. Mass.:
231.1425
SMILES:
NC(C(O)=O)c1ccc(cc1)P(O)(O)=O
: