Target
N-methyl-D-aspartate receptor
Ligand
BDBM50089760
Substrate
Meas. Tech.
ChEMBL_141416 (CHEMBL752320)
IC50
545±n/a nM
Citation
 Pabel, JHöfner, GWanner, KT Synthesis and resolution of racemic eliprodil and evaluation of the enantiomers of eliprodil as NMDA receptor antagonists. Bioorg Med Chem Lett 10:1377-80 (2000)  
Target
Name:
N-methyl-D-aspartate receptor
Synonyms:
Glutamate (NMDA) receptor subunit zeta 1
Type:
PROTEIN
Mol. Mass.:
27123.62
Organism:
Sus scrofa
Description:
ChEMBL_141416
Residue:
243
  
Inhibitor
Name:
BDBM50089760
Synonyms:
(S)-1-(4-Chloro-phenyl)-2-[4-(4-fluoro-benzyl)-piperidin-1-yl]-ethanol | CHEMBL28565
Type:
Small organic molecule
Emp. Form.:
C20H23ClFNO
Mol. Mass.:
347.854
SMILES:
O[C@H](CN1CCC(Cc2ccc(F)cc2)CC1)c1ccc(Cl)cc1
: