Target
Neuropeptide Y receptor type 2
Ligand
BDBM50090282
Substrate
Meas. Tech.
ChEBML_143845
IC50
78000±n/a nM
Citation
 Aiglstorfer, IHendrich, IMoser, CBernhardt, GDove, SBuschauer, A Structure-activity relationships of neuropeptide Y Y1 receptor antagonists related to BIBP 3226. Bioorg Med Chem Lett 10:1597-600 (2000)  
Target
Name:
Neuropeptide Y receptor type 2
Synonyms:
NPY-Y2 NPY2-R NPY2R_HUMAN Y2 receptor | neuropeptide Y receptor Y2
Type:
Enzyme Catalytic Domain
Mol. Mass.:
42734.65
Organism:
Homo sapiens (Human)
Description:
NPY-Y2 NPY2R HUMAN::P49146
Residue:
381
  
Inhibitor
Name:
BDBM50090282
Synonyms:
2-Biphenyl-4-yl-N-{1-(7-hydroxy-1,3,4,5-tetrahydro-benzo[c]azepine-2-carbonyl)-4-[N'-(3-phenyl-propyl)-guanidino]-butyl}-acetamide | CHEMBL290175
Type:
Small organic molecule
Emp. Form.:
C39H45N5O3
Mol. Mass.:
631.8063
SMILES:
Oc1ccc2CN(CCCc2c1)C(=O)C(CCCNC(=N)NCCCc1ccccc1)NC(=O)Cc1ccc(cc1)-c1ccccc1
: