Target
Neuromedin-K receptor
Ligand
BDBM50090487
Substrate
Meas. Tech.
ChEBML_209537
IC50
17±n/a nM
Citation
 Nishi, TIshibashi, KTakemoto, TNakajima, KFukazawa, TIio, YItoh, KMukaiyama, OYamaguchi, T Combined tachykinin receptor antagonist: synthesis and stereochemical structure-activity relationships of novel morpholine analogues. Bioorg Med Chem Lett 10:1665-8 (2000)  
Target
Name:
Neuromedin-K receptor
Synonyms:
NK3R_CAVPO Neurokinin NK3 TACR3
Type:
Enzyme Catalytic Domain
Mol. Mass.:
49456.44
Organism:
GUINEA PIG
Description:
Neurokinin NK3 TACR3 GUINEA PIG::P30098
Residue:
440
  
Inhibitor
Name:
BDBM50090487
Synonyms:
CHEMBL298247 | spiro[(2-hydroxy)indane-1,40-piperidine] analogue
Type:
Small organic molecule
Emp. Form.:
C35H40Cl2N2O6
Mol. Mass.:
655.608
SMILES:
COc1cc(cc(OC)c1OC)C(=O)N1CCO[C@@](CCN2CCC3(CC2)[C@H](O)Cc2ccccc32)(C1)c1ccc(Cl)c(Cl)c1
: