Target
Adenylate cyclase type 5
Ligand
BDBM50090529
Substrate
Meas. Tech.
ChEBML_31732
IC50
7.2±n/a nM
Citation
 Isaac, MSlassi, AXin, TMacLean, NWilson, JMcCallum, KWang, HDemchyshyn, L 6-Bicyclopiperazinyl-1-arylsulfonylindoles and 6-bicyclopiperidinyl-1-arylsulfonylindoles derivatives as novel, potent, and selective 5-HT6 receptor antagonists. Bioorg Med Chem Lett 10:1719-21 (2000)  
Target
Name:
Adenylate cyclase type 5
Synonyms:
ADCY5 Adenylate cyclase | Adenylate cyclase type V
Type:
PROTEIN
Mol. Mass.:
138919.21
Organism:
Homo sapiens (Human)
Description:
ChEMBL_31732
Residue:
1261
  
Inhibitor
Name:
BDBM50090529
Synonyms:
2-[1-(Naphthalene-1-sulfonyl)-1H-indol-6-yl]-octahydro-pyrrolo[1,2-a]pyrazine | CHEMBL46187
Type:
Small organic molecule
Emp. Form.:
C25H25N3O2S
Mol. Mass.:
431.55
SMILES:
O=S(=O)(c1cccc2ccccc12)n1ccc2ccc(cc12)N1CCN2CCCC2C1
: